Target
Aldo-keto reductase family 1 member B1
Ligand
BDBM23416
Substrate
Meas. Tech.
ChEMBL_504440 (CHEMBL986727)
IC50
>30000±n/a nM
Citation
 Morikawa, TKishi, APongpiriyadacha, YMatsuda, HYoshikawa, M Structures of new friedelane-type triterpenes and eudesmane-type sesquiterpene and aldose reductase inhibitors from Salacia chinensis. J Nat Prod 66:1191-6 (2003)  
Target
Name:
Aldo-keto reductase family 1 member B1
Synonyms:
ALDR_RAT Akr1b4 Aldr1
Type:
PROTEIN
Mol. Mass.:
35797.87
Organism:
Rattus norvegicus
Description:
ChEMBL_1512484
Residue:
316
  
Inhibitor
Name:
BDBM23416
Synonyms:
α-CA inhibitor, 3 (2R,3S)-2-(3,4-dihydroxyphenyl)-3,4-dihydro-2H-1-benzopyran-3,5,7-triol Catechin | D-Catechin
Type:
Flavonol
Emp. Form.:
C15H14O6
Mol. Mass.:
290.2681
SMILES:
O[C@H]1Cc2c(O)cc(O)cc2O[C@@H]1c1ccc(O)c(O)c1
: