Target
Acetylcholinesterase
Ligand
BDBM50251187
Substrate
Meas. Tech.
ChEMBL_531267 (CHEMBL986117)
IC50
490±n/a nM
Citation
 Wen, HLin, CQue, LGe, HMa, LCao, RWan, YPeng, WWang, ZSong, H Synthesis and biological evaluation of helicid analogues as novel acetylcholinesterase inhibitors. Eur J Med Chem 43:166-73 (2008)  
Target
Name:
Acetylcholinesterase
Synonyms:
ACES_ELEEL Acetylcholinesterase (EeAChE) | ache
Type:
Enzyme
Mol. Mass.:
71812.79
Organism:
Electrophorus electricus (Electric eel)
Description:
Residue:
633
  
Inhibitor
Name:
BDBM50251187
Synonyms:
1-(4-(O-beta-D-Glucopyranosyl) benzylidene) methoxyamine CHEMBL458398
Type:
Small organic molecule
Emp. Form.:
C14H19NO7
Mol. Mass.:
313.3032
SMILES:
CO\N=C/c1ccc(O[C@@H]2O[C@H](CO)[C@@H](O)[C@H](O)[C@H]2O)cc1
: