Target
Acetylcholinesterase
Ligand
BDBM50251186
Substrate
Meas. Tech.
ChEMBL_531267 (CHEMBL986117)
IC50
4790±n/a nM
Citation
 Wen, HLin, CQue, LGe, HMa, LCao, RWan, YPeng, WWang, ZSong, H Synthesis and biological evaluation of helicid analogues as novel acetylcholinesterase inhibitors. Eur J Med Chem 43:166-73 (2008)  
Target
Name:
Acetylcholinesterase
Synonyms:
ACES_ELEEL Acetylcholinesterase (EeAChE) | ache
Type:
Enzyme
Mol. Mass.:
71812.79
Organism:
Electrophorus electricus (Electric eel)
Description:
Residue:
633
  
Inhibitor
Name:
BDBM50251186
Synonyms:
1-(4-(O-beta-D-Glucopyranosyl) benzylidene) hydroxylamine CHEMBL569304
Type:
Small organic molecule
Emp. Form.:
C13H17NO7
Mol. Mass.:
299.2766
SMILES:
OC[C@H]1O[C@@H](Oc2ccc(CN=O)cc2)[C@H](O)[C@@H](O)[C@@H]1O
: