Target
Acetylcholinesterase
Ligand
BDBM50251170
Substrate
Meas. Tech.
ChEMBL_531267 (CHEMBL986117)
IC50
15090±n/a nM
Citation
 Wen, HLin, CQue, LGe, HMa, LCao, RWan, YPeng, WWang, ZSong, H Synthesis and biological evaluation of helicid analogues as novel acetylcholinesterase inhibitors. Eur J Med Chem 43:166-73 (2008)  
Target
Name:
Acetylcholinesterase
Synonyms:
ACES_ELEEL Acetylcholinesterase (EeAChE) | ache
Type:
Enzyme
Mol. Mass.:
71812.79
Organism:
Electrophorus electricus (Electric eel)
Description:
Residue:
633
  
Inhibitor
Name:
BDBM50251170
Synonyms:
(2R,3R,4S,5R,6S)-2-(acetoxymethyl)-6-(4-((methoxyimino)methyl)phenoxy)tetrahydro-2H-pyran-3,4,5-triyl triacetate CHEMBL463856
Type:
Small organic molecule
Emp. Form.:
C22H27NO11
Mol. Mass.:
481.4499
SMILES:
CO\N=C/c1ccc(O[C@@H]2O[C@H](COC(C)=O)[C@@H](OC(C)=O)[C@H](OC(C)=O)[C@H]2OC(C)=O)cc1
: