Target
Acetylcholinesterase
Ligand
BDBM50251167
Substrate
Meas. Tech.
ChEMBL_531267 (CHEMBL986117)
IC50
21470±n/a nM
Citation
 Wen, HLin, CQue, LGe, HMa, LCao, RWan, YPeng, WWang, ZSong, H Synthesis and biological evaluation of helicid analogues as novel acetylcholinesterase inhibitors. Eur J Med Chem 43:166-73 (2008)  
Target
Name:
Acetylcholinesterase
Synonyms:
ACES_ELEEL Acetylcholinesterase (EeAChE) | ache
Type:
Enzyme
Mol. Mass.:
71812.79
Organism:
Electrophorus electricus (Electric eel)
Description:
Residue:
633
  
Inhibitor
Name:
BDBM50251167
Synonyms:
1-(4-(2,3,4,6-Tetra-O-acetyl-beta-D-glucopyranosyl) benzylidene)thiosemicarbazide CHEMBL569974
Type:
Small organic molecule
Emp. Form.:
C22H27N3O10S
Mol. Mass.:
525.529
SMILES:
CC(=O)OC[C@H]1O[C@@H](Oc2ccc(C=NNC(N)=S)cc2)[C@H](OC(C)=O)[C@@H](OC(C)=O)[C@@H]1OC(C)=O
: