Target
Acetylcholinesterase
Ligand
BDBM50245885
Substrate
Meas. Tech.
ChEMBL_531267 (CHEMBL986117)
IC50
14040±n/a nM
Citation
 Wen, HLin, CQue, LGe, HMa, LCao, RWan, YPeng, WWang, ZSong, H Synthesis and biological evaluation of helicid analogues as novel acetylcholinesterase inhibitors. Eur J Med Chem 43:166-73 (2008)  
Target
Name:
Acetylcholinesterase
Synonyms:
ACES_ELEEL Acetylcholinesterase (EeAChE) | ache
Type:
Enzyme
Mol. Mass.:
71812.79
Organism:
Electrophorus electricus (Electric eel)
Description:
Residue:
633
  
Inhibitor
Name:
BDBM50245885
Synonyms:
(2S,3R,4R,5R)-4,5-bis(benzoyloxy)-2-(4-formylphenoxy)oxan-3-yl benzoate CHEMBL450898
Type:
Small organic molecule
Emp. Form.:
C33H26O9
Mol. Mass.:
566.5541
SMILES:
O=Cc1ccc(O[C@@H]2OC[C@@H](OC(=O)c3ccccc3)[C@@H](OC(=O)c3ccccc3)[C@H]2OC(=O)c2ccccc2)cc1
: