Target
Acetylcholinesterase
Ligand
BDBM50251161
Substrate
Meas. Tech.
ChEMBL_531267 (CHEMBL986117)
IC50
34960±n/a nM
Citation
 Wen, HLin, CQue, LGe, HMa, LCao, RWan, YPeng, WWang, ZSong, H Synthesis and biological evaluation of helicid analogues as novel acetylcholinesterase inhibitors. Eur J Med Chem 43:166-73 (2008)  
Target
Name:
Acetylcholinesterase
Synonyms:
ACES_ELEEL Acetylcholinesterase (EeAChE) | ache
Type:
Enzyme
Mol. Mass.:
71812.79
Organism:
Electrophorus electricus (Electric eel)
Description:
Residue:
633
  
Inhibitor
Name:
BDBM50251161
Synonyms:
(2S,3R,4S,5R)-2-(4-formylphenoxy)tetrahydro-2H-pyran-3,4,5-triyl tribenzoate CHEMBL445976
Type:
Small organic molecule
Emp. Form.:
C33H26O9
Mol. Mass.:
566.5541
SMILES:
O=Cc1ccc(O[C@@H]2OC[C@@H](OC(=O)c3ccccc3)[C@H](OC(=O)c3ccccc3)[C@H]2OC(=O)c2ccccc2)cc1
: