Target
Cholinesterase
Ligand
BDBM50251190
Substrate
Meas. Tech.
ChEMBL_531268 (CHEMBL986118)
IC50
39600±n/a nM
Citation
 Wen, HLin, CQue, LGe, HMa, LCao, RWan, YPeng, WWang, ZSong, H Synthesis and biological evaluation of helicid analogues as novel acetylcholinesterase inhibitors. Eur J Med Chem 43:166-73 (2008)  
Target
Name:
Cholinesterase
Synonyms:
BCHE CHLE_HORSE | Cholinesterase
Type:
Enzyme
Mol. Mass.:
65643.35
Organism:
Equus caballus (Horse)
Description:
P81908
Residue:
574
  
Inhibitor
Name:
BDBM50251190
Synonyms:
1-(4-(2,3,4-Tri-O-benzoyl-beta-D-ribopyranosyl) benzylidene)hydroxylamine | CHEMBL500712
Type:
Small organic molecule
Emp. Form.:
C33H27NO9
Mol. Mass.:
581.5688
SMILES:
O=NCc1ccc(O[C@@H]2OC[C@@H](OC(=O)c3ccccc3)[C@@H](OC(=O)c3ccccc3)[C@H]2OC(=O)c2ccccc2)cc1
: