Target
Acetylcholinesterase
Ligand
BDBM50245883
Substrate
Meas. Tech.
ChEMBL_531267 (CHEMBL986117)
IC50
1500±n/a nM
Citation
 Wen, HLin, CQue, LGe, HMa, LCao, RWan, YPeng, WWang, ZSong, H Synthesis and biological evaluation of helicid analogues as novel acetylcholinesterase inhibitors. Eur J Med Chem 43:166-73 (2008)  
Target
Name:
Acetylcholinesterase
Synonyms:
ACES_ELEEL Acetylcholinesterase (EeAChE) | ache
Type:
Enzyme
Mol. Mass.:
71812.79
Organism:
Electrophorus electricus (Electric eel)
Description:
Residue:
633
  
Inhibitor
Name:
BDBM50245883
Synonyms:
(2R,3R,4S,5R,6S)-2-(acetoxymethyl)-6-(4-formylphenoxy)tetrahydro-2H-pyran-3,4,5-triyl triacetate Acetic acid (2S,3R,4S,5R,6R)-4,5-diacetoxy-6-acetoxymethyl-2-(4-formyl-phenoxy)-tetrahydro-pyran-3-yl ester | CHEMBL461514
Type:
Small organic molecule
Emp. Form.:
C21H24O11
Mol. Mass.:
452.4087
SMILES:
CC(=O)OC[C@H]1O[C@@H](Oc2ccc(C=O)cc2)[C@H](OC(C)=O)[C@@H](OC(C)=O)[C@@H]1OC(C)=O
: