Target
Kappa-type opioid receptor
Ligand
BDBM50194264
Substrate
Meas. Tech.
ChEMBL_533286 (CHEMBL973305)
Ki
1.8±n/a nM
Citation
 Wentland, MPSun, XCohen, DJBidlack, JM Redefining the structure-activity relationships of 2,6-methano-3-benzazocines. Part 6: Opioid receptor binding properties of cyclic variants of 8-carboxamidocyclazocine. Bioorg Med Chem 16:5653-64 (2008)  
Target
Name:
Kappa-type opioid receptor
Synonyms:
K-OR-1 Kappa-opioid receptor (KOR) Kappa-type opioid receptor (KOR) OPIATE Kappa OPRK1 kappa opioid receptor (KOR)
Type:
G Protein-Coupled Receptor (GPCR)
Mol. Mass.:
42648.76
Organism:
Homo sapiens (Human)
Description:
P41145
Residue:
380
  
Inhibitor
Name:
BDBM50194264
Synonyms:
(+/-)-3-(cyclopropylmethyl)-1,2,3,4,5,6-hexahydro-cis-6,11-dimethyl-N-(2-[1,1'-biphenyl]-4-ylethyl)-2,6-methano-3-benzazocine-8-carboxamide CHEMBL377789 cis-rac-3-Cyclopropylmethyl-6,11-dimethyl-1,2,3,4,5,6-hexahydro-2,6-methano-benzo[d]azocine-8-carboxylic acid (2-biphenyl-4-yl-ethyl)-amide
Type:
Small organic molecule
Emp. Form.:
C33H38N2O
Mol. Mass.:
478.6676
SMILES:
C[C@H]1C2Cc3ccc(cc3[C@@]1(C)CCN2CC1CC1)C(=O)NCCc1ccc(cc1)-c1ccccc1
: