Target
Cholinesterase
Ligand
BDBM50271472
Substrate
Meas. Tech.
ChEMBL_552458 (CHEMBL1002718)
Ki
0.924±n/a nM
Citation
 Butini, SCampiani, GBorriello, MGemma, SPanico, APersico, MCatalanotti, BRos, SBrindisi, MAgnusdei, MFiorini, INacci, VNovellino, EBelinskaya, TSaxena, AFattorusso, C Exploiting protein fluctuations at the active-site gorge of human cholinesterases: further optimization of the design strategy to develop extremely potent inhibitors. J Med Chem 51:3154-70 (2008)  
Target
Name:
Cholinesterase
Synonyms:
Acylcholine acylhydrolase Butyrylcholine esterase (BChE) Butyrylcholinesterase (BuChE) CHLE_HUMAN Cholinesterases Pseudocholinesterase
Type:
Homotetramer
Mol. Mass.:
68422.27
Organism:
Homo sapiens (Human)
Description:
P06276
Residue:
602
  
Inhibitor
Name:
BDBM50271472
Synonyms:
1,3-bis{[(1,2,3,4-Tetrahydroacridin-9-yl)amino]ethyl}benzene | CHEMBL490264
Type:
Small organic molecule
Emp. Form.:
C36H38N4
Mol. Mass.:
526.7137
SMILES:
C(Cc1cccc(CCNc2c3CCCCc3nc3ccccc23)c1)Nc1c2CCCCc2nc2ccccc12
: