Target
Acetylcholinesterase
Ligand
BDBM50377921
Substrate
Meas. Tech.
ChEMBL_552871 (CHEMBL960588)
IC50
1.74±n/a nM
Citation
 Camps, PFormosa, XGaldeano, CGómez, TMuñoz-Torrero, DScarpellini, MViayna, EBadia, AClos, MVCamins, APallàs, MBartolini, MMancini, FAndrisano, VEstelrich, JLizondo, MBidon-Chanal, ALuque, FJ Novel donepezil-based inhibitors of acetyl- and butyrylcholinesterase and acetylcholinesterase-induced beta-amyloid aggregation. J Med Chem 51:3588-98 (2008)  
Target
Name:
Acetylcholinesterase
Synonyms:
ACES_BOVIN Acetylcholinesterase (AChE) | Acetylcholinesterase precursor
Type:
Enzyme
Mol. Mass.:
67659.62
Organism:
Bos taurus (bovine)
Description:
Residue:
613
  
Inhibitor
Name:
BDBM50377921
Synonyms:
SODIUM NITROPRUSSIDE
Type:
Small organic molecule
Emp. Form.:
C5FeN6O
Mol. Mass.:
215.939
SMILES:
O=N[Fe--](C#N)(C#N)(C#N)(C#N)C#N
: