Target
Acetylcholinesterase
Ligand
BDBM50271191
Substrate
Meas. Tech.
ChEMBL_552871 (CHEMBL960588)
IC50
1.86±n/a nM
Citation
 Camps, PFormosa, XGaldeano, CGómez, TMuñoz-Torrero, DScarpellini, MViayna, EBadia, AClos, MVCamins, APallàs, MBartolini, MMancini, FAndrisano, VEstelrich, JLizondo, MBidon-Chanal, ALuque, FJ Novel donepezil-based inhibitors of acetyl- and butyrylcholinesterase and acetylcholinesterase-induced beta-amyloid aggregation. J Med Chem 51:3588-98 (2008)  
Target
Name:
Acetylcholinesterase
Synonyms:
ACES_BOVIN Acetylcholinesterase (AChE) | Acetylcholinesterase precursor
Type:
Enzyme
Mol. Mass.:
67659.62
Organism:
Bos taurus (bovine)
Description:
Residue:
613
  
Inhibitor
Name:
BDBM50271191
Synonyms:
6-Chloro-9-[(2-{4-[(5,6-dimethoxyindan-2-yl)methyl]piperidin-1-yl}ethyl)amino]-1,2,3,4-tetrahydroacridine dihydrochloride | CHEMBL520046
Type:
Small organic molecule
Emp. Form.:
C32H40ClN3O2
Mol. Mass.:
534.132
SMILES:
COc1cc2CC(CC3CCN(CCNc4c5CCCCc5nc5cc(Cl)ccc45)CC3)Cc2cc1OC
: