Target
Neutral cholesterol ester hydrolase 1
Ligand
BDBM50204490
Substrate
Meas. Tech.
ChEMBL_513867 (CHEMBL970761)
IC50
>100000±n/a nM
Citation
 Garfunkle, JEzzili, CRayl, TJHochstatter, DGHwang, IBoger, DL Optimization of the central heterocycle of alpha-ketoheterocycle inhibitors of fatty acid amide hydrolase. J Med Chem 51:4392-403 (2008)  
Target
Name:
Neutral cholesterol ester hydrolase 1
Synonyms:
AADACL1 NCEH1 | NCEH1_HUMAN
Type:
PROTEIN
Mol. Mass.:
45810.81
Organism:
Homo sapiens (Human)
Description:
ChEMBL_835312
Residue:
408
  
Inhibitor
Name:
BDBM50204490
Synonyms:
CHEMBL220784 | methyl 2-(7-phenylheptanoyl)oxazole-5-carboxylate
Type:
Small organic molecule
Emp. Form.:
C18H21NO4
Mol. Mass.:
315.3636
SMILES:
COC(=O)c1cnc(o1)C(=O)CCCCCCc1ccccc1
: