Target
Carbonic anhydrase 5A, mitochondrial
Ligand
BDBM50261759
Substrate
Meas. Tech.
ChEMBL_514688 (CHEMBL976460)
Ki
16.9±n/a nM
Citation
 Poulsen, SAWilkinson, BLInnocenti, AVullo, DSupuran, CT Inhibition of human mitochondrial carbonic anhydrases VA and VB with para-(4-phenyltriazole-1-yl)-benzenesulfonamide derivatives. Bioorg Med Chem Lett 18:4624-7 (2008)  
Target
Name:
Carbonic anhydrase 5A, mitochondrial
Synonyms:
CA-VA CA5A Carbonate dehydratase VA Carbonic anhydrase 5A (CA VA) Carbonic anhydrase 5A, mitochondrial precursor Carbonic anhydrase VA (CA VA)
Type:
Enzyme
Mol. Mass.:
34755.54
Organism:
Homo sapiens (Human)
Description:
Human (cloned) isozyme
Residue:
305
  
Inhibitor
Name:
BDBM50261759
Synonyms:
4-(4-(4-methoxy-2-methylphenyl)-1H-1,2,3-triazol-1-yl)benzenesulfonamide | CHEMBL512809
Type:
Small organic molecule
Emp. Form.:
C16H16N4O3S
Mol. Mass.:
344.388
SMILES:
COc1ccc(-c2cn(nn2)-c2ccc(cc2)S(N)(=O)=O)c(C)c1
: