Target
Carbonic anhydrase 5A, mitochondrial
Ligand
BDBM50262066
Substrate
Meas. Tech.
ChEMBL_514688 (CHEMBL976460)
Ki
15.1±n/a nM
Citation
 Poulsen, SAWilkinson, BLInnocenti, AVullo, DSupuran, CT Inhibition of human mitochondrial carbonic anhydrases VA and VB with para-(4-phenyltriazole-1-yl)-benzenesulfonamide derivatives. Bioorg Med Chem Lett 18:4624-7 (2008)  
Target
Name:
Carbonic anhydrase 5A, mitochondrial
Synonyms:
CA-VA CA5A Carbonate dehydratase VA Carbonic anhydrase 5A (CA VA) Carbonic anhydrase 5A, mitochondrial precursor Carbonic anhydrase VA (CA VA)
Type:
Enzyme
Mol. Mass.:
34755.54
Organism:
Homo sapiens (Human)
Description:
Human (cloned) isozyme
Residue:
305
  
Inhibitor
Name:
BDBM50262066
Synonyms:
4-{1-[4-(aminosulfonyl)phenyl]-1H-1,2,3-triazol-4-yl}benzenesulfonamide | CHEMBL469064
Type:
Small organic molecule
Emp. Form.:
C14H13N5O4S2
Mol. Mass.:
379.414
SMILES:
NS(=O)(=O)c1ccc(cc1)-c1cn(nn1)-c1ccc(cc1)S(N)(=O)=O
: