Target
17-beta-hydroxysteroid dehydrogenase type 1
Ligand
BDBM50237104
Substrate
Meas. Tech.
ChEMBL_555024 (CHEMBL957999)
IC50
27±n/a nM
Citation
 Schuster, DNashev, LGKirchmair, JLaggner, CWolber, GLanger, TOdermatt, A Discovery of nonsteroidal 17beta-hydroxysteroid dehydrogenase 1 inhibitors by pharmacophore-based screening of virtual compound libraries. J Med Chem 51:4188-99 (2008)  
Target
Name:
17-beta-hydroxysteroid dehydrogenase type 1
Synonyms:
17-beta-HSD 1 17-beta-hydroxysteroid dehydrogenase type 1 20-alpha-HSD E17KSR EDH17B1 EDHB17 Estradiol 17-beta-dehydrogenase 1 (17beta-HSD1) Placental 17-beta-hydroxysteroid dehydrogenase | SDR28C1
Type:
Enzyme
Mol. Mass.:
34945.13
Organism:
Homo sapiens (Human)
Description:
P14061
Residue:
328
  
Inhibitor
Name:
BDBM50237104
Synonyms:
2-((8R,9S,13S,14S,16R)-2-ethyl-3-hydroxy-13-methyl-17-oxo-7,8,9,11,12,13,14,15,16,17-decahydro-6H-cyclopenta[a]phenanthren-16-yl)-N-(pyridin-3-ylmethyl)acetamide | CHEMBL407968
Type:
Small organic molecule
Emp. Form.:
C28H34N2O3
Mol. Mass.:
446.5812
SMILES:
CCc1cc2[C@H]3CC[C@@]4(C)[C@@H](C[C@H](CC(=O)NCc5cccnc5)C4=O)[C@@H]3CCc2cc1O
: