Target
Gamma-aminobutyric acid receptor subunit alpha-1
Ligand
BDBM50244074
Substrate
Meas. Tech.
ChEMBL_491118 (CHEMBL991886)
Kd
3.3±n/a nM
Citation
 Harris, DClayton, TCook, JSahbaie, PHalliwell, RFFurtmüller, RHuck, SSieghart, WDeLorey, TM Selective influence on contextual memory: physiochemical properties associated with selectivity of benzodiazepine ligands at GABAA receptors containing the alpha5 subunit. J Med Chem 51:3788-803 (2008)  
Target
Name:
Gamma-aminobutyric acid receptor subunit alpha-1
Synonyms:
Benzodiazepine central GABA A Benzodiazepine liver GABA(A) receptor subunit alpha-1 GABA-A receptor GBRA1_HUMAN TBPS | agonist GABA site
Type:
Protein
Mol. Mass.:
51817.35
Organism:
Homo sapiens (Human)
Description:
P14867
Residue:
456
  
Inhibitor
Name:
BDBM50244074
Synonyms:
CHEMBL510658 | ethyl 7-azido-4-methyl-5-oxo-4,5-dihydroimidazo[1,5-a]quinazoline-3-carboxylate
Type:
Small organic molecule
Emp. Form.:
C14H12N6O3
Mol. Mass.:
312.2835
SMILES:
CCOC(=O)c1ncn2c1n(C)c(=O)c1cc(ccc21)N=[N+]=[N-]
: