Target
Gamma-aminobutyric acid receptor subunit alpha-1
Ligand
BDBM50244073
Substrate
Meas. Tech.
ChEMBL_491118 (CHEMBL991886)
Kd
2±n/a nM
Citation
 Harris, DClayton, TCook, JSahbaie, PHalliwell, RFFurtmüller, RHuck, SSieghart, WDeLorey, TM Selective influence on contextual memory: physiochemical properties associated with selectivity of benzodiazepine ligands at GABAA receptors containing the alpha5 subunit. J Med Chem 51:3788-803 (2008)  
Target
Name:
Gamma-aminobutyric acid receptor subunit alpha-1
Synonyms:
Benzodiazepine central GABA A Benzodiazepine liver GABA(A) receptor subunit alpha-1 GABA-A receptor GBRA1_HUMAN TBPS | agonist GABA site
Type:
Protein
Mol. Mass.:
51817.35
Organism:
Homo sapiens (Human)
Description:
P14867
Residue:
456
  
Inhibitor
Name:
BDBM50244073
Synonyms:
CHEMBL454866 | ethyl 7-fluoro-4-methyl-5-oxo-1,3a,4,5-tetrahydroimidazo[1,5-a]quinazoline-3-carboxylate
Type:
Small organic molecule
Emp. Form.:
C14H14FN3O3
Mol. Mass.:
291.2777
SMILES:
CCOC(=O)C1=C2N(CN1)c1ccc(F)cc1C(=O)N2C
: