Target
Gamma-aminobutyric acid receptor subunit alpha-1
Ligand
BDBM50017009
Substrate
Meas. Tech.
ChEMBL_491118 (CHEMBL991886)
Kd
8.3±n/a nM
Citation
 Harris, DClayton, TCook, JSahbaie, PHalliwell, RFFurtmüller, RHuck, SSieghart, WDeLorey, TM Selective influence on contextual memory: physiochemical properties associated with selectivity of benzodiazepine ligands at GABAA receptors containing the alpha5 subunit. J Med Chem 51:3788-803 (2008)  
Target
Name:
Gamma-aminobutyric acid receptor subunit alpha-1
Synonyms:
Benzodiazepine central GABA A Benzodiazepine liver GABA(A) receptor subunit alpha-1 GABA-A receptor GBRA1_HUMAN TBPS | agonist GABA site
Type:
Protein
Mol. Mass.:
51817.35
Organism:
Homo sapiens (Human)
Description:
P14867
Residue:
456
  
Inhibitor
Name:
BDBM50017009
Synonyms:
2-Phenyl-2,3a-dihydro-pyrazolo[4,3-c]quinolin-3-one(CGS 8216) 2-Phenyl-2,5-dihydro-pyrazolo[4,3-c]quinolin-3-one (CGS 8216) 2-Phenyl-2,5-dihydro-pyrazolo[4,3-c]quinolin-3-one(CGS-8216) CGS 8216, 1 CHEMBL19732
Type:
Small organic molecule
Emp. Form.:
C16H11N3O
Mol. Mass.:
261.278
SMILES:
O=c1n([nH]c2c1cnc1ccccc21)-c1ccccc1
: