Target
Tyrosine-protein phosphatase non-receptor type 1
Ligand
BDBM50072598
Substrate
Meas. Tech.
ChEMBL_491985 (CHEMBL951535)
IC50
175000±n/a nM
Citation
 Hussain, MAhmed, VHill, BAhmed, ZTaylor, SD A re-examination of the difluoromethylenesulfonic acid group as a phosphotyrosine mimic for PTP1B inhibition. Bioorg Med Chem 16:6764-77 (2008)  
Target
Name:
Tyrosine-protein phosphatase non-receptor type 1
Synonyms:
PTN1_HUMAN PTPN1 Protein tyrosine phosphatase-1B (PTP1B) Protein-tyrosine phosphatase 1B (PTP1B) Tyrosine-protein phosphatase non-receptor type 1 (PTP1B)
Type:
Protein phosphatase
Mol. Mass.:
49963.76
Organism:
Homo sapiens (Human)
Description:
Human recombinant GST-fusion PTP1B (1-435).
Residue:
435
  
Inhibitor
Name:
BDBM50072598
Synonyms:
CHEMBL109646 difluoro(naphthalen-2-yl)methanesulfonate
Type:
Small organic molecule
Emp. Form.:
C11H7F2O3S
Mol. Mass.:
257.234
SMILES:
[O-]S(=O)(=O)C(F)(F)c1ccc2ccccc2c1
: