Target
Small conductance calcium-activated potassium channel protein 3
Ligand
BDBM50264020
Substrate
Meas. Tech.
ChEMBL_535545 (CHEMBL986171)
IC50
290±n/a nM
Citation
 Gentles, RGGrant-Young, KHu, SHuang, YPoss, MAAndres, CFiedler, TKnox, RLodge, NWeaver, CDHarden, DG Initial SAR studies on apamin-displacing 2-aminothiazole blockers of calcium-activated small conductance potassium channels. Bioorg Med Chem Lett 18:5316-9 (2008)  
Target
Name:
Small conductance calcium-activated potassium channel protein 3
Synonyms:
K3 KCNN3_HUMAN Small conductance calcium-activated potassium channel protein 3 (KCa2.3)
Type:
Protein
Mol. Mass.:
82053.75
Organism:
Homo sapiens (Human)
Description:
Q9UGI6
Residue:
731
  
Inhibitor
Name:
BDBM50264020
Synonyms:
CHEMBL489770 N-(4-(pyridin-2-yl)thiazol-2-yl)pyridin-2-amine US9034574, I
Type:
Small organic molecule
Emp. Form.:
C13H10N4S
Mol. Mass.:
254.31
SMILES:
N(c1nc(cs1)-c1ccccn1)c1ccccn1
: