Target
Aromatase
Ligand
BDBM50049391
Substrate
Meas. Tech.
ChEMBL_535644 (CHEMBL987972)
Ki
100000±n/a nM
Citation
 Paoletta, SSteventon, GBWildeboer, DEhrman, TMHylands, PJBarlow, DJ Screening of herbal constituents for aromatase inhibitory activity. Bioorg Med Chem 16:8466-70 (2008)  
Target
Name:
Aromatase
Synonyms:
ARO1 CP19A_HUMAN CYP19 CYPXIX Cytochrome P450 19A1 Cytochrome P450-C19 (CYP19) FL cytokine receptor precursor | P-450AROM
Type:
Enzyme
Mol. Mass.:
57888.92
Organism:
Homo sapiens (Human)
Description:
P11511
Residue:
503
  
Inhibitor
Name:
BDBM50049391
Synonyms:
3,5,7-Trihydroxyflavone 3,5,7-trihydroxy-2-phenyl-4H-benzopyran-4-one CHEMBL309490 Galangin (15) cid_5281616 | norizalpinin
Type:
Small organic molecule
Emp. Form.:
C15H10O5
Mol. Mass.:
270.2369
SMILES:
Oc1cc(O)c2c(c1)oc(-c1ccccc1)c(O)c2=O
: