Target
5-hydroxytryptamine receptor 2A
Ligand
BDBM50005251
Substrate
Meas. Tech.
ChEMBL_537763 (CHEMBL994216)
Ki
5200±n/a nM
Citation
 Runyon, SPMosier, PDRoth, BLGlennon, RAWestkaemper, RB Potential modes of interaction of 9-aminomethyl-9,10-dihydroanthracene (AMDA) derivatives with the 5-HT2A receptor: a ligand structure-affinity relationship, receptor mutagenesis and receptor modeling investigation. J Med Chem 51:6808-28 (2008)  
Target
Name:
5-hydroxytryptamine receptor 2A
Synonyms:
5-HT-2 5-HT2A 5-hydroxytryptamine receptor 2A (5HT-2A) 5HT2A_HUMAN HTR2A | Serotonin receptor 2A
Type:
undefined
Mol. Mass.:
52607.65
Organism:
Homo sapiens (Human)
Description:
P28223
Residue:
471
  
Inhibitor
Name:
BDBM50005251
Synonyms:
(+/-)2-(2,5-Dimethoxy-phenyl)-1-methyl-ethylamine 2,5-dimethoxy-4-bromoamphetamine 2-(2,5-Dimethoxy-phenyl)-1-methyl-ethylamine(2,5-DMA) DMA
Type:
Small organic molecule
Emp. Form.:
C11H17NO2
Mol. Mass.:
195.2582
SMILES:
COc1ccc(OC)c(CC(C)N)c1
: