Target
Galectin-7
Ligand
BDBM50273433
Substrate
Meas. Tech.
ChEMBL_560913 (CHEMBL1013548)
Kd
24000±n/a nM
Citation
 Delaine, TCumpstey, IIngrassia, LLe Mercier, MOkechukwu, PLeffler, HKiss, RNilsson, UJ Galectin-inhibitory thiodigalactoside ester derivatives have antimigratory effects in cultured lung and prostate cancer cells. J Med Chem 51:8109-14 (2008)  
Target
Name:
Galectin-7
Synonyms:
Gal-7 LEG7_HUMAN PI7 p53-induced gene 1 protein
Type:
Galactoside-binding protein
Mol. Mass.:
15077.89
Organism:
Homo sapiens (Human)
Description:
Residue:
136
  
Inhibitor
Name:
BDBM50273433
Synonyms:
Bis-(3-O-1-naphthoyl-beta-D-galactopyranosyl)sulfane | CHEMBL509180
Type:
Small organic molecule
Emp. Form.:
C34H34O12S
Mol. Mass.:
666.692
SMILES:
OC[C@H]1O[C@@H](S[C@@H]2O[C@H](CO)[C@H](O)[C@H](OC(=O)c3cccc4ccccc34)[C@H]2O)[C@H](O)[C@@H](OC(=O)c2cccc3ccccc23)[C@H]1O
: