Target
3-oxoacyl-[acyl-carrier-protein] synthase 3
Ligand
BDBM50245925
Substrate
Meas. Tech.
ChEMBL_559691 (CHEMBL1010089)
IC50
34.4±n/a nM
Citation
 Alhamadsheh, MMWaters, NCSachdeva, SLee, PReynolds, KA Synthesis and biological evaluation of novel sulfonyl-naphthalene-1,4-diols as FabH inhibitors. Bioorg Med Chem Lett 18:6402-5 (2008)  
Target
Name:
3-oxoacyl-[acyl-carrier-protein] synthase 3
Synonyms:
β-Ketoacyl-acyl carrier protein (ACP) synthase III (FabH) FABH_MYCTU | fabH
Type:
Enzyme
Mol. Mass.:
34865.07
Organism:
Mycobacterium tuberculosis
Description:
P9WNG3
Residue:
335
  
Inhibitor
Name:
BDBM50245925
Synonyms:
2-tosylbenzene-1,4-diol | CHEMBL462375
Type:
Small organic molecule
Emp. Form.:
C13H12O4S
Mol. Mass.:
264.297
SMILES:
Cc1ccc(cc1)S(=O)(=O)c1cc(O)ccc1O
: