Target
3-oxoacyl-[acyl-carrier-protein] synthase 3
Ligand
BDBM50245927
Substrate
Meas. Tech.
ChEMBL_559691 (CHEMBL1010089)
IC50
138.1±n/a nM
Citation
 Alhamadsheh, MMWaters, NCSachdeva, SLee, PReynolds, KA Synthesis and biological evaluation of novel sulfonyl-naphthalene-1,4-diols as FabH inhibitors. Bioorg Med Chem Lett 18:6402-5 (2008)  
Target
Name:
3-oxoacyl-[acyl-carrier-protein] synthase 3
Synonyms:
β-Ketoacyl-acyl carrier protein (ACP) synthase III (FabH) FABH_MYCTU | fabH
Type:
Enzyme
Mol. Mass.:
34865.07
Organism:
Mycobacterium tuberculosis
Description:
P9WNG3
Residue:
335
  
Inhibitor
Name:
BDBM50245927
Synonyms:
2-tosylnaphthalene | CHEMBL462553
Type:
Small organic molecule
Emp. Form.:
C17H14O2S
Mol. Mass.:
282.357
SMILES:
Cc1ccc(cc1)S(=O)(=O)c1ccc2ccccc2c1
: