Target
3-oxoacyl-[acyl-carrier-protein] synthase 3
Ligand
BDBM50245831
Substrate
Meas. Tech.
ChEMBL_559691 (CHEMBL1010089)
IC50
112±n/a nM
Citation
 Alhamadsheh, MMWaters, NCSachdeva, SLee, PReynolds, KA Synthesis and biological evaluation of novel sulfonyl-naphthalene-1,4-diols as FabH inhibitors. Bioorg Med Chem Lett 18:6402-5 (2008)  
Target
Name:
3-oxoacyl-[acyl-carrier-protein] synthase 3
Synonyms:
β-Ketoacyl-acyl carrier protein (ACP) synthase III (FabH) FABH_MYCTU | fabH
Type:
Enzyme
Mol. Mass.:
34865.07
Organism:
Mycobacterium tuberculosis
Description:
P9WNG3
Residue:
335
  
Inhibitor
Name:
BDBM50245831
Synonyms:
2-(p-tolylthio)naphthalene-1,4-dione | CHEMBL501551
Type:
Small organic molecule
Emp. Form.:
C17H12O2S
Mol. Mass.:
280.341
SMILES:
Cc1ccc(SC2=CC(=O)c3ccccc3C2=O)cc1
: