Target
Beta-ketoacyl-[acyl-carrier-protein] synthase III
Ligand
BDBM50245879
Substrate
Meas. Tech.
ChEMBL_559689 (CHEMBL1010087)
IC50
128.7±n/a nM
Citation
 Alhamadsheh, MMWaters, NCSachdeva, SLee, PReynolds, KA Synthesis and biological evaluation of novel sulfonyl-naphthalene-1,4-diols as FabH inhibitors. Bioorg Med Chem Lett 18:6402-5 (2008)  
Target
Name:
Beta-ketoacyl-[acyl-carrier-protein] synthase III
Synonyms:
Beta-ketoacyl-ACP-synthase III
Type:
PROTEIN
Mol. Mass.:
42334.64
Organism:
Plasmodium falciparum
Description:
ChEMBL_559689
Residue:
371
  
Inhibitor
Name:
BDBM50245879
Synonyms:
2-(4-chlorophenylsulfonyl)naphthalene-1,4-diol | CHEMBL460104
Type:
Small organic molecule
Emp. Form.:
C16H11ClO4S
Mol. Mass.:
334.774
SMILES:
Oc1cc(c(O)c2ccccc12)S(=O)(=O)c1ccc(Cl)cc1
: