Target
Beta-ketoacyl-[acyl-carrier-protein] synthase III
Ligand
BDBM50245924
Substrate
Meas. Tech.
ChEMBL_559689 (CHEMBL1010087)
IC50
341.1±n/a nM
Citation
 Alhamadsheh, MMWaters, NCSachdeva, SLee, PReynolds, KA Synthesis and biological evaluation of novel sulfonyl-naphthalene-1,4-diols as FabH inhibitors. Bioorg Med Chem Lett 18:6402-5 (2008)  
Target
Name:
Beta-ketoacyl-[acyl-carrier-protein] synthase III
Synonyms:
Beta-ketoacyl-ACP-synthase III
Type:
PROTEIN
Mol. Mass.:
42334.64
Organism:
Plasmodium falciparum
Description:
ChEMBL_559689
Residue:
371
  
Inhibitor
Name:
BDBM50245924
Synonyms:
2-tosylanthracene-1,4-diol | CHEMBL451059
Type:
Small organic molecule
Emp. Form.:
C21H16O4S
Mol. Mass.:
364.414
SMILES:
Cc1ccc(cc1)S(=O)(=O)c1cc(O)c2cc3ccccc3cc2c1O
: