Target
Metabotropic glutamate receptor 5
Ligand
BDBM17657
Substrate
Meas. Tech.
ChEMBL_559519 (CHEMBL1018992)
Ki
1160±n/a nM
Citation
 Filosa, RCarmela Fulco, MMarinozzi, MGiacchè, NMacchiarulo, APeduto, AMassa, Ade Caprariis, PThomsen, CChristoffersen, CTPellicciari, R Design, synthesis and biological evaluation of novel bicyclo[1.1.1]pentane-based omega-acidic amino acids as glutamate receptors ligands. Bioorg Med Chem 17:242-50 (2008)  
Target
Name:
Metabotropic glutamate receptor 5
Synonyms:
GPRC1E GRM5_HUMAN metabotropic glutamate 5 | metabotropic glutamate 5a
Type:
Enzyme
Mol. Mass.:
132484.72
Organism:
Homo sapiens (Human)
Description:
Residue:
1212
  
Inhibitor
Name:
BDBM17657
Synonyms:
(2S)-2-aminopentanedioic acid D-Glutamate L-Glu L-Glutamic acid L-gluatmate
Type:
Amino Acid
Emp. Form.:
C5H9NO4
Mol. Mass.:
147.1293
SMILES:
N[C@@H](CCC(O)=O)C(O)=O
: