Target
Translocator protein
Ligand
BDBM50253929
Substrate
Meas. Tech.
ChEMBL_511514 (CHEMBL980957)
Ki
3.9±n/a nM
Citation
 Da Settimo, FSimorini, FTaliani, SLa Motta, CMarini, AMSalerno, SBellandi, MNovellino, EGreco, GCosimelli, BDa Pozzo, ECosta, BSimola, NMorelli, MMartini, C Anxiolytic-like effects of N,N-dialkyl-2-phenylindol-3-ylglyoxylamides by modulation of translocator protein promoting neurosteroid biosynthesis. J Med Chem 51:5798-806 (2008)  
Target
Name:
Translocator protein
Synonyms:
Benzodiazepine receptors; peripheral & central Mbr PBR Peripheral benzodiazepine receptor (PBR) TSPO_RAT | Tspo
Type:
Mitochondrion membrane protein
Mol. Mass.:
18945.84
Organism:
Rattus norvegicus (rat)
Description:
Competitive binding experiments were performed on rat kidney mitochondrial membranes.
Residue:
169
  
Inhibitor
Name:
BDBM50253929
Synonyms:
CHEMBL460156 | N-butyl-2-(5-chloro-2-phenyl-1H-indol-3-yl)-N-methyl-2-oxoacetamide
Type:
Small organic molecule
Emp. Form.:
C21H21ClN2O2
Mol. Mass.:
368.857
SMILES:
CCCCN(C)C(=O)C(=O)c1c([nH]c2ccc(Cl)cc12)-c1ccccc1
: