Target
Translocator protein
Ligand
BDBM50253814
Substrate
Meas. Tech.
ChEMBL_511514 (CHEMBL980957)
Ki
2.3±n/a nM
Citation
 Da Settimo, FSimorini, FTaliani, SLa Motta, CMarini, AMSalerno, SBellandi, MNovellino, EGreco, GCosimelli, BDa Pozzo, ECosta, BSimola, NMorelli, MMartini, C Anxiolytic-like effects of N,N-dialkyl-2-phenylindol-3-ylglyoxylamides by modulation of translocator protein promoting neurosteroid biosynthesis. J Med Chem 51:5798-806 (2008)  
Target
Name:
Translocator protein
Synonyms:
Benzodiazepine receptors; peripheral & central Mbr PBR Peripheral benzodiazepine receptor (PBR) TSPO_RAT | Tspo
Type:
Mitochondrion membrane protein
Mol. Mass.:
18945.84
Organism:
Rattus norvegicus (rat)
Description:
Competitive binding experiments were performed on rat kidney mitochondrial membranes.
Residue:
169
  
Inhibitor
Name:
BDBM50253814
Synonyms:
CHEMBL461843 | N-benzyl-N-ethyl-2-(7-methyl-2-phenyl-1H-indol-3-yl)-2-oxoacetamide
Type:
Small organic molecule
Emp. Form.:
C26H24N2O2
Mol. Mass.:
396.481
SMILES:
CCN(Cc1ccccc1)C(=O)C(=O)c1c([nH]c2c(C)cccc12)-c1ccccc1
: