Target
Peroxisome proliferator-activated receptor alpha
Ligand
BDBM50264537
Substrate
Meas. Tech.
ChEMBL_539584 (CHEMBL1035759)
EC50
21600±n/a nM
Citation
 Suh, YGKim, NJKoo, BWLee, KOMoon, SHShin, DHJung, JWPaek, SMChang, DJLi, FKang, HJLe, TVChae, YNShin, CYKim, MKLim, JIRyu, JSPark, HJ Design, synthesis, and biological evaluation of novel constrained meta-substituted phenyl propanoic acids as peroxisome proliferator-activated receptor alpha and gamma dual agonists. J Med Chem 51:6318-33 (2008)  
Target
Name:
Peroxisome proliferator-activated receptor alpha
Synonyms:
NR1C1 PPAR PPAR-alpha PPARA_HUMAN Peroxisome proliferator-activated receptor | Peroxisome proliferator-activated receptor alpha (PPAR alpha)
Type:
Enzyme
Mol. Mass.:
52222.08
Organism:
Homo sapiens (Human)
Description:
Q07869
Residue:
468
  
Inhibitor
Name:
BDBM50264537
Synonyms:
(S)-3-(3-(5-Benzyl-4,5-dihydroisoxazol-3-yl)phenyl)-2-ethoxypropanoicAcid | CHEMBL484063
Type:
Small organic molecule
Emp. Form.:
C21H23NO4
Mol. Mass.:
353.4116
SMILES:
CCO[C@@H](Cc1cccc(c1)C1=NOC(Cc2ccccc2)C1)C(O)=O
: