Target
Fatty-acid amide hydrolase 1
Ligand
BDBM50261710
Substrate
Meas. Tech.
ChEMBL_494689 (CHEMBL938648)
Ki
1.1±n/a nM
Citation
 Seierstad, MBreitenbucher, JG Discovery and development of fatty acid amide hydrolase (FAAH) inhibitors. J Med Chem 51:7327-43 (2009)  
Target
Name:
Fatty-acid amide hydrolase 1
Synonyms:
Anandamide amidohydrolase FAAH FAAH1_HUMAN Fatty-acid amide hydrolase (FAAH) Oleamide hydrolase 1
Type:
Protein
Mol. Mass.:
63071.19
Organism:
Homo sapiens (Human)
Description:
O00519
Residue:
579
  
Inhibitor
Name:
BDBM50261710
Synonyms:
7-Phenyl-1-(2-(pyridin-2-yl)-2H-tetrazol-5-yl)-heptan-1-one CHEMBL467368
Type:
Small organic molecule
Emp. Form.:
C19H21N5O
Mol. Mass.:
335.4029
SMILES:
O=C(CCCCCCc1ccccc1)c1nnn(n1)-c1ccccn1
: