Target
Fatty-acid amide hydrolase 1
Ligand
BDBM23061
Substrate
Meas. Tech.
ChEMBL_494689 (CHEMBL938648)
Ki
0.9±n/a nM
Citation
 Seierstad, MBreitenbucher, JG Discovery and development of fatty acid amide hydrolase (FAAH) inhibitors. J Med Chem 51:7327-43 (2009)  
Target
Name:
Fatty-acid amide hydrolase 1
Synonyms:
Anandamide amidohydrolase FAAH FAAH1_HUMAN Fatty-acid amide hydrolase (FAAH) Oleamide hydrolase 1
Type:
Protein
Mol. Mass.:
63071.19
Organism:
Homo sapiens (Human)
Description:
O00519
Residue:
579
  
Inhibitor
Name:
BDBM23061
Synonyms:
7-(3-chlorophenyl)-1-[5-(pyridin-2-yl)-1,3-oxazol-2-yl]heptan-1-one alpha-ketooxazole, 5hh
Type:
Small organic molecule
Emp. Form.:
C21H21ClN2O2
Mol. Mass.:
368.857
SMILES:
Clc1cccc(CCCCCCC(=O)c2ncc(o2)-c2ccccn2)c1
: