Target
Fatty-acid amide hydrolase 1
Ligand
BDBM50161525
Substrate
Meas. Tech.
ChEMBL_494689 (CHEMBL938648)
Ki
0.520±n/a nM
Citation
 Seierstad, MBreitenbucher, JG Discovery and development of fatty acid amide hydrolase (FAAH) inhibitors. J Med Chem 51:7327-43 (2009)  
Target
Name:
Fatty-acid amide hydrolase 1
Synonyms:
Anandamide amidohydrolase FAAH FAAH1_HUMAN Fatty-acid amide hydrolase (FAAH) Oleamide hydrolase 1
Type:
Protein
Mol. Mass.:
63071.19
Organism:
Homo sapiens (Human)
Description:
O00519
Residue:
579
  
Inhibitor
Name:
BDBM50161525
Synonyms:
1-(oxazolo[4,5-b]pyridin-2-yl)-9-phenylnonan-1-one CHEMBL182199
Type:
Small organic molecule
Emp. Form.:
C21H24N2O2
Mol. Mass.:
336.4275
SMILES:
O=C(CCCCCCCCc1ccccc1)c1nc2ncccc2o1
: