Target
Small conductance calcium-activated potassium channel protein 3
Ligand
BDBM50275184
Substrate
Meas. Tech.
ChEMBL_494974 (CHEMBL1008046)
Ki
>50000±n/a nM
Citation
 Sørensen, USStrøbaek, DChristophersen, PHougaard, CJensen, MLNielsen, EŘPeters, DTeuber, L Synthesis and structure-activity relationship studies of 2-(N-substituted)-aminobenzimidazoles as potent negative gating modulators ofsmall conductance Ca2+-activated K+ channels. J Med Chem 51:7625-34 (2009)  
Target
Name:
Small conductance calcium-activated potassium channel protein 3
Synonyms:
KCNN3_RAT SK3 | Small conductance calcium-activated potassium channel
Type:
PROTEIN
Mol. Mass.:
81476.29
Organism:
Rattus norvegicus
Description:
ChEMBL_494975
Residue:
732
  
Inhibitor
Name:
BDBM50275184
Synonyms:
6,7-dichloro-3-(hydroxyimino)indolin-2-one | CHEMBL499968
Type:
Small organic molecule
Emp. Form.:
C8H4Cl2N2O2
Mol. Mass.:
231.036
SMILES:
Clc1ccc2C(N=O)C(=O)Nc2c1Cl
: