Target
Small conductance calcium-activated potassium channel protein 3
Ligand
BDBM50263331
Substrate
Meas. Tech.
ChEMBL_494974 (CHEMBL1008046)
Ki
>50000±n/a nM
Citation
 Sørensen, USStrøbaek, DChristophersen, PHougaard, CJensen, MLNielsen, EŘPeters, DTeuber, L Synthesis and structure-activity relationship studies of 2-(N-substituted)-aminobenzimidazoles as potent negative gating modulators ofsmall conductance Ca2+-activated K+ channels. J Med Chem 51:7625-34 (2009)  
Target
Name:
Small conductance calcium-activated potassium channel protein 3
Synonyms:
KCNN3_RAT SK3 | Small conductance calcium-activated potassium channel
Type:
PROTEIN
Mol. Mass.:
81476.29
Organism:
Rattus norvegicus
Description:
ChEMBL_494975
Residue:
732
  
Inhibitor
Name:
BDBM50263331
Synonyms:
(1H-Benzoimidazol-2-yl)-(R)-1,2,3,4-tetrahydronaphthalen-1-ylamine CHEMBL510780
Type:
Small organic molecule
Emp. Form.:
C17H17N3
Mol. Mass.:
263.337
SMILES:
C1C[C@@H](Nc2nc3ccccc3[nH]2)c2ccccc2C1
: