Target
3-beta-hydroxysteroid-Delta(8),Delta(7)-isomerase
Ligand
BDBM50109389
Substrate
Meas. Tech.
ChEMBL_496150 (CHEMBL1000139)
Ki
595±n/a nM
Citation
 Berardi, FAbate, CFerorelli, Sde Robertis, AFLeopoldo, MColabufo, NANiso, MPerrone, R Novel 4-(4-aryl)cyclohexyl-1-(2-pyridyl)piperazines as Delta(8)-Delta(7) sterol isomerase (emopamil binding protein) selective ligands with antiproliferative activity. J Med Chem 51:7523-31 (2009)  
Target
Name:
3-beta-hydroxysteroid-Delta(8),Delta(7)-isomerase
Synonyms:
EBP | EBP_CAVPO
Type:
PROTEIN
Mol. Mass.:
26684.52
Organism:
Cavia porcellus
Description:
ChEMBL_203193
Residue:
229
  
Inhibitor
Name:
BDBM50109389
Synonyms:
1-Phenethyl-piperidine CHEMBL75228 N-phenethylpiperidine
Type:
Small organic molecule
Emp. Form.:
C13H19N
Mol. Mass.:
189.2967
SMILES:
C(Cc1ccccc1)N1CCCCC1
: