Target
Carbonic anhydrase
Ligand
BDBM10869
Substrate
Meas. Tech.
ChEMBL_515851 (CHEMBL993110)
Ki
360±n/a nM
Citation
 Isik, SKockar, FAydin, MArslan, OGuler, OOInnocenti, AScozzafava, ASupuran, CT Carbonic anhydrase inhibitors: inhibition of the beta-class enzyme from the yeast Saccharomyces cerevisiae with sulfonamides and sulfamates. Bioorg Med Chem 17:1158-63 (2009)  
Target
Name:
Carbonic anhydrase
Synonyms:
CAN_YEAST NCE3
Type:
PROTEIN
Mol. Mass.:
24861.97
Organism:
Saccharomyces cerevisiae
Description:
ChEMBL_1507033
Residue:
221
  
Inhibitor
Name:
BDBM10869
Synonyms:
5-imino-4-methyl-4,5-dihydro-1,3,4-thiadiazole-2-sulfonamide aromatic/heteroaromatic sulfonamide 14
Type:
Small organic molecule
Emp. Form.:
C3H6N4O2S2
Mol. Mass.:
194.235
SMILES:
Cn1nc(sc1=N)S(N)(=O)=O
: