Target
Carbonic anhydrase
Ligand
BDBM26999
Substrate
Meas. Tech.
ChEMBL_515851 (CHEMBL993110)
Ki
1020±n/a nM
Citation
 Isik, SKockar, FAydin, MArslan, OGuler, OOInnocenti, AScozzafava, ASupuran, CT Carbonic anhydrase inhibitors: inhibition of the beta-class enzyme from the yeast Saccharomyces cerevisiae with sulfonamides and sulfamates. Bioorg Med Chem 17:1158-63 (2009)  
Target
Name:
Carbonic anhydrase
Synonyms:
CAN_YEAST NCE3
Type:
PROTEIN
Mol. Mass.:
24861.97
Organism:
Saccharomyces cerevisiae
Description:
ChEMBL_1507033
Residue:
221
  
Inhibitor
Name:
BDBM26999
Synonyms:
4-(1,1-dioxo-1,2-thiazinan-2-yl)benzene-1-sulfonamide Contravul Sulthiame (SLT) | Sulthiame, 2
Type:
Small organic molecule
Emp. Form.:
C10H14N2O4S2
Mol. Mass.:
290.359
SMILES:
NS(=O)(=O)c1ccc(cc1)N1CCCCS1(=O)=O
: