Target
Carbonic anhydrase 2
Ligand
BDBM10886
Substrate
Meas. Tech.
ChEMBL_515850 (CHEMBL993109)
Ki
9±n/a nM
Citation
 Isik, SKockar, FAydin, MArslan, OGuler, OOInnocenti, AScozzafava, ASupuran, CT Carbonic anhydrase inhibitors: inhibition of the beta-class enzyme from the yeast Saccharomyces cerevisiae with sulfonamides and sulfamates. Bioorg Med Chem 17:1158-63 (2009)  
Target
Name:
Carbonic anhydrase 2
Synonyms:
CA-II CAC Carbonate dehydratase II Carbonic anhydrase 2 (CA-II) Carbonic anhydrase C Carbonic anhydrase II (CA-II) Carbonic anhydrase II (hCA II) | Carbonic anhydrase isoenzyme II (hCA II)
Type:
Enzyme
Mol. Mass.:
29250.71
Organism:
Homo sapiens (Human)
Description:
P00918
Residue:
260
  
Inhibitor
Name:
BDBM10886
Synonyms:
2-N-benzene-1,3,4-thiadiazole-2,5-disulfonamide Benzolamide CHEMBL73962
Type:
Small organic molecule
Emp. Form.:
C8H8N4O4S3
Mol. Mass.:
320.369
SMILES:
NS(=O)(=O)c1nnc(NS(=O)(=O)c2ccccc2)s1
: