Target
5-hydroxytryptamine receptor 6
Ligand
BDBM34154
Substrate
Meas. Tech.
ChEMBL_517120 (CHEMBL989583)
Ki
10±n/a nM
Citation
 Alcalde, EMesquida, NLópez-Pérez, SFrigola, JMercè, R Indene-based scaffolds. 2. An indole-indene switch: discovery of novel indenylsulfonamides as 5-HT6 serotonin receptor agonists. J Med Chem 52:675-87 (2009)  
Target
Name:
5-hydroxytryptamine receptor 6
Synonyms:
5-HT-6 5-hydroxytryptamine receptor 6 (5-HT-6) 5-hydroxytryptamine receptor 6 (5HT6) HTR6 Serotonin 6 (5-HT6) receptor | Serotonin Receptor 6
Type:
G Protein-Coupled Receptor (GPCR)
Mol. Mass.:
46968.43
Organism:
Homo sapiens (Human)
Description:
P50406
Residue:
440
  
Inhibitor
Name:
BDBM34154
Synonyms:
CHEMBL515307 | indenylsulfonamide, 15
Type:
Small organic molecule
Emp. Form.:
C18H19ClN4O2S2
Mol. Mass.:
422.952
SMILES:
CN(C)CCC1=CCc2ccc(NS(=O)(=O)c3c(Cl)nc4sccn34)cc12
: