Target
Alpha-2A adrenergic receptor
Ligand
BDBM50266578
Substrate
Meas. Tech.
ChEMBL_517125 (CHEMBL989588)
IC50
700±n/a nM
Citation
 Alcalde, EMesquida, NLópez-Pérez, SFrigola, JMercè, R Indene-based scaffolds. 2. An indole-indene switch: discovery of novel indenylsulfonamides as 5-HT6 serotonin receptor agonists. J Med Chem 52:675-87 (2009)  
Target
Name:
Alpha-2A adrenergic receptor
Synonyms:
ADA2A_HUMAN ADRA2R Adrenergic alpha2A Alpha-2 adrenergic receptor subtype C10 Alpha-2A adrenoreceptor alpha-2A adrenergic receptor [Homo sapiens]
Type:
Enzyme
Mol. Mass.:
48979.91
Organism:
Homo sapiens (Human)
Description:
P08913
Residue:
465
  
Inhibitor
Name:
BDBM50266578
Synonyms:
CHEMBL477650 | N-{3-[2-(Dimethylamino)ethyl]-2-methyl-1H-inden-5-yl}-1-benzothiophene-3-sulfonamide
Type:
Small organic molecule
Emp. Form.:
C22H24N2O2S2
Mol. Mass.:
412.568
SMILES:
CN(C)CCC1=C(C)Cc2ccc(NS(=O)(=O)c3csc4ccccc34)cc12
: