Target
5-hydroxytryptamine receptor 1A
Ligand
BDBM34153
Substrate
Meas. Tech.
ChEMBL_517126 (CHEMBL989589)
IC50
>1000±n/a nM
Citation
 Alcalde, EMesquida, NLópez-Pérez, SFrigola, JMercè, R Indene-based scaffolds. 2. An indole-indene switch: discovery of novel indenylsulfonamides as 5-HT6 serotonin receptor agonists. J Med Chem 52:675-87 (2009)  
Target
Name:
5-hydroxytryptamine receptor 1A
Synonyms:
5-HT-1A 5-hydroxytryptamine receptor 1A (5-HT-1A) ADRB2RL1 Dopamine D2 receptor and serotonin 1a receptor HTR1A | Serotonin receptor 1A
Type:
Mol. Mass.:
46122.49
Organism:
Homo sapiens (Human)
Description:
Residue:
422
  
Inhibitor
Name:
BDBM34153
Synonyms:
CHEMBL476006 | indenylsulfonamide, 14
Type:
Small organic molecule
Emp. Form.:
C19H21ClN4O2S2
Mol. Mass.:
436.979
SMILES:
CN(C)CCC1=C(C)Cc2ccc(NS(=O)(=O)c3c(Cl)nc4sccn34)cc12
: