Target
5-hydroxytryptamine receptor 2C
Ligand
BDBM34153
Substrate
Meas. Tech.
ChEMBL_517127 (CHEMBL989590)
IC50
1127±n/a nM
Citation
 Alcalde, EMesquida, NLópez-Pérez, SFrigola, JMercè, R Indene-based scaffolds. 2. An indole-indene switch: discovery of novel indenylsulfonamides as 5-HT6 serotonin receptor agonists. J Med Chem 52:675-87 (2009)  
Target
Name:
5-hydroxytryptamine receptor 2C
Synonyms:
5-HT-1C 5-HT1C 5-HT2C-INI 5-HTR2C 5-hydroxytryptamine receptor 2C (5-HT-2C) 5HT-1C HTR1C Serotonin (5-HT3) receptor Serotonin Receptor 2C
Type:
G Protein-Coupled Receptor (GPCR)
Mol. Mass.:
51836.79
Organism:
Homo sapiens (Human)
Description:
P28335
Residue:
458
  
Inhibitor
Name:
BDBM34153
Synonyms:
CHEMBL476006 | indenylsulfonamide, 14
Type:
Small organic molecule
Emp. Form.:
C19H21ClN4O2S2
Mol. Mass.:
436.979
SMILES:
CN(C)CCC1=C(C)Cc2ccc(NS(=O)(=O)c3c(Cl)nc4sccn34)cc12
: