Target
Sodium-dependent serotonin transporter
Ligand
BDBM34154
Substrate
Meas. Tech.
ChEMBL_517128 (CHEMBL989591)
IC50
>10000±n/a nM
Citation
 Alcalde, EMesquida, NLópez-Pérez, SFrigola, JMercè, R Indene-based scaffolds. 2. An indole-indene switch: discovery of novel indenylsulfonamides as 5-HT6 serotonin receptor agonists. J Med Chem 52:675-87 (2009)  
Target
Name:
Sodium-dependent serotonin transporter
Synonyms:
5-HT Transporter 5HTT SC6A4_HUMAN SLC6A4 Serotonin transporter (5HTT) Sodium-dependent serotonin transporter (SERT) | Solute carrier family 6 member 4
Type:
Multi-pass membrane protein
Mol. Mass.:
70322.51
Organism:
Homo sapiens (Human)
Description:
P31645
Residue:
630
  
Inhibitor
Name:
BDBM34154
Synonyms:
CHEMBL515307 | indenylsulfonamide, 15
Type:
Small organic molecule
Emp. Form.:
C18H19ClN4O2S2
Mol. Mass.:
422.952
SMILES:
CN(C)CCC1=CCc2ccc(NS(=O)(=O)c3c(Cl)nc4sccn34)cc12
: