Target
5-hydroxytryptamine receptor 6
Ligand
BDBM21358
Substrate
Meas. Tech.
ChEMBL_517120 (CHEMBL989583)
Ki
2±n/a nM
Citation
 Alcalde, EMesquida, NLópez-Pérez, SFrigola, JMercè, R Indene-based scaffolds. 2. An indole-indene switch: discovery of novel indenylsulfonamides as 5-HT6 serotonin receptor agonists. J Med Chem 52:675-87 (2009)  
Target
Name:
5-hydroxytryptamine receptor 6
Synonyms:
5-HT-6 5-hydroxytryptamine receptor 6 (5-HT-6) 5-hydroxytryptamine receptor 6 (5HT6) HTR6 Serotonin 6 (5-HT6) receptor | Serotonin Receptor 6
Type:
G Protein-Coupled Receptor (GPCR)
Mol. Mass.:
46968.43
Organism:
Homo sapiens (Human)
Description:
P50406
Residue:
440
  
Inhibitor
Name:
BDBM21358
Synonyms:
2-[1-({6-chloroimidazo[2,1-b][1,3]thiazole-5-}sulfonyl)-1H-indol-3-yl]ethan-1-amine SAX-187 | WAY-181187
Type:
Small organic molecule
Emp. Form.:
C15H13ClN4O2S2
Mol. Mass.:
380.872
SMILES:
NCCc1cn(c2ccccc12)S(=O)(=O)c1c(Cl)nc2sccn12
: