Target
Amine oxidase [flavin-containing] A
Ligand
BDBM50276190
Substrate
Meas. Tech.
ChEMBL_543072 (CHEMBL1022171)
Ki
180±n/a nM
Citation
 Vilches-Herrera, MMiranda-Sepúlveda, JRebolledo-Fuentes, MFierro, ALühr, SIturriaga-Vasquez, PCassels, BKReyes-Parada, M Naphthylisopropylamine and N-benzylamphetamine derivatives as monoamine oxidase inhibitors. Bioorg Med Chem 17:2452-60 (2009)  
Target
Name:
Amine oxidase [flavin-containing] A
Synonyms:
AOFA_RAT Amine oxidase [flavin-containing] A Monoamine Oxidase Type A (MAO-A) Monoamine oxidase A (MAO-A) Monoamine oxidase type A (MAOA)
Type:
Enzyme
Mol. Mass.:
59515.21
Organism:
Rattus norvegicus (rat)
Description:
Residue:
526
  
Inhibitor
Name:
BDBM50276190
Synonyms:
(6-Methoxy-2-naphthyl)-2-aminopropane | CHEMBL443427
Type:
Small organic molecule
Emp. Form.:
C14H17NO
Mol. Mass.:
215.2909
SMILES:
COc1ccc2cc(CC(C)N)ccc2c1
: